Reaction Details
TargetCarbonic anhydrase 12
LigandBDBM33268
Substrate/CompetitorBDBM10856
Meas. Tech.CA Inhibition Assay
Ki 69.4±n/a nM
Citation Carta, FMaresca, AScozzafava, AVullo, DSupuran, CT Carbonic anhydrase inhibitors. Diazenylbenzenesulfonamides are potent and selective inhibitors of the tumor-associated isozymes IX and XII over the cytosolic isoforms I and II. Bioorg Med Chem17:7093-9 (2009) 
 
Carbonic anhydrase 12
Name:Carbonic anhydrase 12
Type:Enzyme
Mol. Mass.:39456.00
Organism:Homo sapiens (Human)
Description:Catalytic domain of human cloned isozyme was used in the assay
Residue:354
BDBM33268
BDBM10856
NameBDBM33268
Synonyms:azo-sulfonamide, 1c
TypeSmall organic molecule
Emp. Form.C13H14N4O2S
Mol. Mass.290.341
SMILESCNc1ccc(cc1)\N=N\c1ccc(cc1)S(N)(=O)=O