Reaction Details
TargetCarbonic anhydrase 12
LigandBDBM33274
Substrate/CompetitorBDBM10856
Meas. Tech.CA Inhibition Assay
Ki 7.9±n/a nM
Citation Carta, FMaresca, AScozzafava, AVullo, DSupuran, CT Carbonic anhydrase inhibitors. Diazenylbenzenesulfonamides are potent and selective inhibitors of the tumor-associated isozymes IX and XII over the cytosolic isoforms I and II. Bioorg Med Chem17:7093-9 (2009) 
 
Carbonic anhydrase 12
Name:Carbonic anhydrase 12
Type:Enzyme
Mol. Mass.:39456.00
Organism:Homo sapiens (Human)
Description:Catalytic domain of human cloned isozyme was used in the assay
Residue:354
BDBM33274
BDBM10856
NameBDBM33274
Synonyms:azo-sulfonamide, 2d
TypeSmall organic molecule
Emp. Form.C14H16N4O2S
Mol. Mass.304.367
SMILESCN(C)c1ccc(cc1)\N=N\c1cccc(c1)S(N)(=O)=O