Reaction Details
TargetCarbonic anhydrase 6
LigandBDBM33280
Substrate/CompetitorBDBM10856
Meas. Tech.CA Inhibition Assay
Ki 1334±n/a nM
Citation Vitale, RMAlterio, VInnocenti, AWinum, JYMonti, SMDe Simone, GSupuran, CT Carbonic anhydrase inhibitors. Comparison of aliphatic sulfamate/bis-sulfamate adducts with isozymes II and IX as a platform for designing tight-binding, more isoform-selective inhibitors. J Med Chem52:5990-8 (2009) 
 
Carbonic anhydrase 6
Name:Carbonic anhydrase 6
Type:Enzyme
Mol. Mass.:35371.40
Organism:Homo sapiens (Human)
Description:P23280
Residue:308
BDBM33280
BDBM10856
NameBDBM33280
Synonyms:CHEMBL153094 | aliphatic sulfamate, 2
TypeSmall organic molecule
Emp. Form.C10H23NO3S
Mol. Mass.237.36
SMILESCCCCCCCCCCOS(N)(=O)=O