Reaction Details
TargetCarbonic anhydrase 7
LigandBDBM33281
Substrate/CompetitorBDBM10856
Meas. Tech.CA Inhibition Assay
Ki 79.6±n/a nM
Citation Vitale, RMAlterio, VInnocenti, AWinum, JYMonti, SMDe Simone, GSupuran, CT Carbonic anhydrase inhibitors. Comparison of aliphatic sulfamate/bis-sulfamate adducts with isozymes II and IX as a platform for designing tight-binding, more isoform-selective inhibitors. J Med Chem52:5990-8 (2009) 
 
Carbonic anhydrase 7
Name:Carbonic anhydrase 7
Type:Enzyme
Mol. Mass.:29664.11
Organism:Homo sapiens (Human)
Description:Human cloned isozyme.
Residue:264
BDBM33281
BDBM10856
NameBDBM33281
Synonyms:CHEMBL182455 | bis-sulfamate, 3
TypeSmall organic molecule
Emp. Form.C8H20N2O6S2
Mol. Mass.304.384
SMILESNS(=O)(=O)OCCCCCCCCOS(N)(=O)=O