Reaction Details
TargetCarbonic anhydrase 7
LigandBDBM33282
Substrate/CompetitorBDBM10856
Meas. Tech.CA Inhibition Assay
Ki 92.3±n/a nM
Citation Vitale, RMAlterio, VInnocenti, AWinum, JYMonti, SMDe Simone, GSupuran, CT Carbonic anhydrase inhibitors. Comparison of aliphatic sulfamate/bis-sulfamate adducts with isozymes II and IX as a platform for designing tight-binding, more isoform-selective inhibitors. J Med Chem52:5990-8 (2009) 
 
Carbonic anhydrase 7
Name:Carbonic anhydrase 7
Type:Enzyme
Mol. Mass.:29664.11
Organism:Homo sapiens (Human)
Description:Human cloned isozyme.
Residue:264
BDBM33282
BDBM10856
NameBDBM33282
Synonyms:CHEMBL171476 | bis-sulfamate, 4
TypeSmall organic molecule
Emp. Form.C10H24N2O6S2
Mol. Mass.332.437
SMILESNS(=O)(=O)OCCCCCCCCCCOS(N)(=O)=O