Reaction Details
TargetCarbonic anhydrase 9
LigandBDBM33280
Substrate/CompetitorBDBM10856
Meas. Tech.CA Inhibition Assay
Ki 23.1±n/a nM
Citation Vitale, RMAlterio, VInnocenti, AWinum, JYMonti, SMDe Simone, GSupuran, CT Carbonic anhydrase inhibitors. Comparison of aliphatic sulfamate/bis-sulfamate adducts with isozymes II and IX as a platform for designing tight-binding, more isoform-selective inhibitors. J Med Chem52:5990-8 (2009) 
 
Carbonic anhydrase 9
Name:Carbonic anhydrase 9
Type:Enzyme
Mol. Mass.:49669.03
Organism:Homo sapiens (Human)
Description:Catalytic domain of human cloned isozyme was used in the assay
Residue:459
BDBM33280
BDBM10856
NameBDBM33280
Synonyms:CHEMBL153094 | aliphatic sulfamate, 2
TypeSmall organic molecule
Emp. Form.C10H23NO3S
Mol. Mass.237.36
SMILESCCCCCCCCCCOS(N)(=O)=O