Reaction Details
TargetCarbonic anhydrase 12
LigandBDBM33279
Substrate/CompetitorBDBM10856
Meas. Tech.CA Inhibition Assay
Ki 7±n/a nM
Citation Vitale, RMAlterio, VInnocenti, AWinum, JYMonti, SMDe Simone, GSupuran, CT Carbonic anhydrase inhibitors. Comparison of aliphatic sulfamate/bis-sulfamate adducts with isozymes II and IX as a platform for designing tight-binding, more isoform-selective inhibitors. J Med Chem52:5990-8 (2009) 
 
Carbonic anhydrase 12
Name:Carbonic anhydrase 12
Type:Enzyme
Mol. Mass.:39456.00
Organism:Homo sapiens (Human)
Description:Catalytic domain of human cloned isozyme was used in the assay
Residue:354
BDBM33279
BDBM10856
NameBDBM33279
Synonyms:CHEMBL24261 | aliphatic sulfamate, 1
TypeSmall organic molecule
Emp. Form.C8H19NO3S
Mol. Mass.209.306
SMILESCCCCCCCCOS(N)(=O)=O