Reaction Details
TargetCarbonic anhydrase 13
LigandBDBM33280
Substrate/CompetitorBDBM10856
Meas. Tech.CA Inhibition Assay
Ki 956±n/a nM
Citation Vitale, RMAlterio, VInnocenti, AWinum, JYMonti, SMDe Simone, GSupuran, CT Carbonic anhydrase inhibitors. Comparison of aliphatic sulfamate/bis-sulfamate adducts with isozymes II and IX as a platform for designing tight-binding, more isoform-selective inhibitors. J Med Chem52:5990-8 (2009) 
 
Carbonic anhydrase 13
Name:Carbonic anhydrase 13
Type:Enzyme
Mol. Mass.:29522.80
Organism:Mus musculus (mouse)
Description:Murine cloned isozyme
Residue:262
BDBM33280
BDBM10856
NameBDBM33280
Synonyms:CHEMBL153094 | aliphatic sulfamate, 2
TypeSmall organic molecule
Emp. Form.C10H23NO3S
Mol. Mass.237.36
SMILESCCCCCCCCCCOS(N)(=O)=O