Reaction Details
TargetCarbonic anhydrase 13
LigandBDBM33282
Substrate/CompetitorBDBM10856
Meas. Tech.CA Inhibition Assay
Ki 960±n/a nM
Citation Vitale, RMAlterio, VInnocenti, AWinum, JYMonti, SMDe Simone, GSupuran, CT Carbonic anhydrase inhibitors. Comparison of aliphatic sulfamate/bis-sulfamate adducts with isozymes II and IX as a platform for designing tight-binding, more isoform-selective inhibitors. J Med Chem52:5990-8 (2009) 
 
Carbonic anhydrase 13
Name:Carbonic anhydrase 13
Type:Enzyme
Mol. Mass.:29522.80
Organism:Mus musculus (mouse)
Description:Murine cloned isozyme
Residue:262
BDBM33282
BDBM10856
NameBDBM33282
Synonyms:CHEMBL171476 | bis-sulfamate, 4
TypeSmall organic molecule
Emp. Form.C10H24N2O6S2
Mol. Mass.332.437
SMILESNS(=O)(=O)OCCCCCCCCCCOS(N)(=O)=O