Reaction Details
TargetPeroxisome proliferator-activated receptor gamma
LigandBDBM33293
Substrate/CompetitorBDBM33297
Meas. Tech.Scintillation Proximity Assay (IC50) and PPAR gamma Transactivation Assay (EC50)
pH7.4±n/a
Temperature296.15±n/a K
IC50 5±n/a nM
EC50 15±n/a nM
CommentsEfficacy=88% (The maximum efficacy of darglitazone was defined as 100%).
Citation Casimiro-Garcia, ABigge, CFDavis, JAPadalino, TPulaski, JOhren, JFMcConnell, PKane, CDRoyer, LJStevens, KAAuerbach, BCollard, WMcGregor, CSong, K Synthesis and evaluation of novel alpha-heteroaryl-phenylpropanoic acid derivatives as PPARalpha/gamma dual agonists. Bioorg Med Chem17:7113-25 (2009) 
 
Peroxisome proliferator-activated receptor gamma
Name:Peroxisome proliferator-activated receptor gamma
Type:Nuclear Receptor
Mol. Mass.:57613.46
Organism:Homo sapiens (Human)
Description:P37231
Residue:505
BDBM33293
BDBM33297
NameBDBM33293
Synonyms:phenylpropanoic acid derivative, 17i | racemic
TypeSmall organic molecule
Emp. Form.C24H24N4O3
Mol. Mass.416.4724
SMILESCc1oc(nc1CCCc1ccc(CC(C(O)=O)n2nccn2)cc1)-c1ccccc1