Reaction Details
TargetEpidermal growth factor receptor
LigandBDBM33402
Substrate/CompetitorBDBM10852
Meas. Tech.Phosphotyrosine (PY) ELISA
pH7.4±n/a
Temperature310.15±n/a K
IC50 2200±310 nM
Citation Gangjee, ALi, WLin, LZeng, YIhnat, MWarnke, LAGreen, DWCody, VPace, JQueener, SF Design, synthesis, and X-ray crystal structures of 2,4-diaminofuro[2,3-d]pyrimidines as multireceptor tyrosine kinase and dihydrofolate reductase inhibitors. Bioorg Med Chem17:7324-36 (2009) 
 
Epidermal growth factor receptor
Name:Epidermal growth factor receptor
Type:Receptor Kinase Domain
Mol. Mass.:134279.59
Organism:Homo sapiens (Human)
Description:P00533
Residue:1210
BDBM33402
BDBM10852
NameBDBM33402
Synonyms:2,4-diaminofuro[2,3-d]pyrimidine, 8
TypeSmall organic molecule
Emp. Form.C18H22N4O2
Mol. Mass.326.3929
SMILESCCCC(Cc1coc2nc(N)nc(N)c12)c1ccccc1OC