Reaction Details
TargetVascular endothelial growth factor receptor 2
LigandBDBM33396
Substrate/CompetitorBDBM10852
Meas. Tech.Phosphotyrosine (PY) ELISA
pH7.4±n/a
Temperature310.15±n/a K
IC50 88200±14300 nM
Citation Gangjee, ALi, WLin, LZeng, YIhnat, MWarnke, LAGreen, DWCody, VPace, JQueener, SF Design, synthesis, and X-ray crystal structures of 2,4-diaminofuro[2,3-d]pyrimidines as multireceptor tyrosine kinase and dihydrofolate reductase inhibitors. Bioorg Med Chem17:7324-36 (2009) 
 
Vascular endothelial growth factor receptor 2
Name:Vascular endothelial growth factor receptor 2
Type:Receptor Tyrosine Kinase
Mol. Mass.:151510.97
Organism:Homo sapiens (Human)
Description:P35968
Residue:1356
BDBM33396
BDBM10852
NameBDBM33396
Synonyms:2,4-diaminofuro[2,3-d]pyrimidine, 2 | E/Z ratio=2:1
TypeSmall organic molecule
Emp. Form.C18H20N4O2
Mol. Mass.324.377
SMILESCCC\C(=C\c1coc2nc(N)nc(N)c12)c1ccccc1OC