Reaction Details
TargetVascular endothelial growth factor receptor 2
LigandBDBM33407
Substrate/CompetitorBDBM10852
Meas. Tech.Phosphotyrosine (PY) ELISA
pH7.4±n/a
Temperature310.15±n/a K
IC50 17400±1500 nM
Citation Gangjee, ALi, WLin, LZeng, YIhnat, MWarnke, LAGreen, DWCody, VPace, JQueener, SF Design, synthesis, and X-ray crystal structures of 2,4-diaminofuro[2,3-d]pyrimidines as multireceptor tyrosine kinase and dihydrofolate reductase inhibitors. Bioorg Med Chem17:7324-36 (2009) 
 
Vascular endothelial growth factor receptor 2
Name:Vascular endothelial growth factor receptor 2
Type:Receptor Tyrosine Kinase
Mol. Mass.:151510.97
Organism:Homo sapiens (Human)
Description:P35968
Residue:1356
BDBM33407
BDBM10852
NameBDBM33407
Synonyms:2,4-diaminofuro[2,3-d]pyrimidine, 13
TypeSmall organic molecule
Emp. Form.C19H24N4O2
Mol. Mass.340.4195
SMILESCCC(C)C(Cc1coc2nc(N)nc(N)c12)c1ccccc1OC