Reaction Details
TargetPlatelet-derived growth factor receptor beta
LigandBDBM33401
Substrate/CompetitorBDBM10852
Meas. Tech.Phosphotyrosine (PY) ELISA
IC50>500000±n/a nM
Citation Gangjee, ALi, WLin, LZeng, YIhnat, MWarnke, LAGreen, DWCody, VPace, JQueener, SF Design, synthesis, and X-ray crystal structures of 2,4-diaminofuro[2,3-d]pyrimidines as multireceptor tyrosine kinase and dihydrofolate reductase inhibitors. Bioorg Med Chem17:7324-36 (2009) 
 
Platelet-derived growth factor receptor beta
Name:Platelet-derived growth factor receptor beta
Type:Enzyme
Mol. Mass.:123922.25
Organism:Homo sapiens (Human)
Description:P09619
Residue:1106
BDBM33401
BDBM10852
NameBDBM33401
Synonyms:2,4-diaminofuro[2,3-d]pyrimidine, 7 | E/Z ratio=3:2
TypeSmall organic molecule
Emp. Form.C19H22N4O2
Mol. Mass.338.4036
SMILESCCC(C)C(=C\c1coc2nc(N)nc(N)c12)\c1ccccc1OC