Reaction Details
TargetPlatelet-derived growth factor receptor beta
LigandBDBM33403
Substrate/CompetitorBDBM10852
Meas. Tech.Phosphotyrosine (PY) ELISA
IC50 5000±n/a nM
Citation Gangjee, ALi, WLin, LZeng, YIhnat, MWarnke, LAGreen, DWCody, VPace, JQueener, SF Design, synthesis, and X-ray crystal structures of 2,4-diaminofuro[2,3-d]pyrimidines as multireceptor tyrosine kinase and dihydrofolate reductase inhibitors. Bioorg Med Chem17:7324-36 (2009) 
 
Platelet-derived growth factor receptor beta
Name:Platelet-derived growth factor receptor beta
Type:Enzyme
Mol. Mass.:123922.25
Organism:Homo sapiens (Human)
Description:P09619
Residue:1106
BDBM33403
BDBM10852
NameBDBM33403
Synonyms:2,4-diaminofuro[2,3-d]pyrimidine, 9
TypeSmall organic molecule
Emp. Form.C18H22N4O2
Mol. Mass.326.3929
SMILESCOc1ccccc1C(Cc1coc2nc(N)nc(N)c12)C(C)C