Reaction Details
TargetBifunctional dihydrofolate reductase-thymidylate synthase
LigandBDBM33402
Substrate/CompetitorBDBM18044
IC50 30000±n/a nM
Citation Gangjee, ALi, WLin, LZeng, YIhnat, MWarnke, LAGreen, DWCody, VPace, JQueener, SF Design, synthesis, and X-ray crystal structures of 2,4-diaminofuro[2,3-d]pyrimidines as multireceptor tyrosine kinase and dihydrofolate reductase inhibitors. Bioorg Med Chem17:7324-36 (2009) 
 
Bifunctional dihydrofolate reductase-thymidylate synthase
Name:Bifunctional dihydrofolate reductase-thymidylate synthase
Type:Enzyme
Mol. Mass.:68757.49
Organism:Toxoplasma gondii
Description:Q07422
Residue:610
BDBM33402
BDBM18044
NameBDBM33402
Synonyms:2,4-diaminofuro[2,3-d]pyrimidine, 8
TypeSmall organic molecule
Emp. Form.C18H22N4O2
Mol. Mass.326.3929
SMILESCCCC(Cc1coc2nc(N)nc(N)c12)c1ccccc1OC