Reaction Details
TargetDihydrofolate reductase
LigandBDBM33407
Substrate/CompetitorBDBM18044
Meas. Tech.Phosphotyrosine (PY) ELISA
IC50 42100±n/a nM
Citation Gangjee, ALi, WLin, LZeng, YIhnat, MWarnke, LAGreen, DWCody, VPace, JQueener, SF Design, synthesis, and X-ray crystal structures of 2,4-diaminofuro[2,3-d]pyrimidines as multireceptor tyrosine kinase and dihydrofolate reductase inhibitors. Bioorg Med Chem17:7324-36 (2009) 
 
Dihydrofolate reductase
Name:Dihydrofolate reductase
Type:Enzyme
Mol. Mass.:21453.99
Organism:Homo sapiens (Human)
Description:Recombinant human DHFR.
Residue:187
BDBM33407
BDBM18044
NameBDBM33407
Synonyms:2,4-diaminofuro[2,3-d]pyrimidine, 13
TypeSmall organic molecule
Emp. Form.C19H24N4O2
Mol. Mass.340.4195
SMILESCCC(C)C(Cc1coc2nc(N)nc(N)c12)c1ccccc1OC