Reaction Details
TargetDihydrofolate reductase
LigandBDBM33400
Substrate/CompetitorBDBM18044
Meas. Tech.Phosphotyrosine (PY) ELISA
IC50 51900±n/a nM
Citation Gangjee, ALi, WLin, LZeng, YIhnat, MWarnke, LAGreen, DWCody, VPace, JQueener, SF Design, synthesis, and X-ray crystal structures of 2,4-diaminofuro[2,3-d]pyrimidines as multireceptor tyrosine kinase and dihydrofolate reductase inhibitors. Bioorg Med Chem17:7324-36 (2009) 
 
Dihydrofolate reductase
Name:Dihydrofolate reductase
Type:Enzyme
Mol. Mass.:21608.82
Organism:Mus musculus (Mouse)
Description:n/a
Residue:187
BDBM33400
BDBM18044
NameBDBM33400
Synonyms:2,4-diaminofuro[2,3-d]pyrimidine, 6 | E/Z ratio=2:1
TypeSmall organic molecule
Emp. Form.C19H22N4O2
Mol. Mass.338.4036
SMILESCOc1ccccc1\C(CC(C)C)=C/c1coc2nc(N)nc(N)c12