Reaction Details
TargetPeptidyl-prolyl cis-trans isomerase NIMA-interacting 1
LigandBDBM34005
Substrate/CompetitorBDBM34002
Meas. Tech.Pin1 Enzymatic Activity Assay
pH7.5±n/a
Temperature288.15±n/a K
Ki 800±n/a nM
Citation Guo, CHou, XDong, LDagostino, EGreasley, SFerre, RMarakovits, JJohnson, MCMatthews, DMroczkowski, BParge, HVanarsdale, TPopoff, IPiraino, JMargosiak, SThomson, JLos, GMurray, BW Structure-based design of novel human Pin1 inhibitors (I). Bioorg Med Chem Lett19:5613-6 (2009) 
 
Peptidyl-prolyl cis-trans isomerase NIMA-interacting 1
Name:Peptidyl-prolyl cis-trans isomerase NIMA-interacting 1
Type:PROTEIN
Mol. Mass.:18248.11
Organism:Homo sapiens (Human)
Description:ChEMBL_1502595
Residue:163
BDBM34005
BDBM34002
NameBDBM34005
Synonyms:pipecolate deriv., 12b
TypeSmall organic molecule
Emp. Form.C35H45N2O7P
Mol. Mass.636.7148
SMILESOP(O)(=O)OC[C@@H](Cc1ccccc1)NC(=O)N1CCCC[C@H]1C(=O)OC(CCCc1ccccc1)CCCc1ccccc1