Reaction Details
TargetPeptidyl-prolyl cis-trans isomerase NIMA-interacting 1
LigandBDBM34011
Substrate/CompetitorBDBM34002
Meas. Tech.Pin1 Enzymatic Activity Assay
pH7.5±n/a
Temperature288.15±n/a K
Ki 8±n/a nM
Citation Guo, CHou, XDong, LDagostino, EGreasley, SFerre, RMarakovits, JJohnson, MCMatthews, DMroczkowski, BParge, HVanarsdale, TPopoff, IPiraino, JMargosiak, SThomson, JLos, GMurray, BW Structure-based design of novel human Pin1 inhibitors (I). Bioorg Med Chem Lett19:5613-6 (2009) 
 
Peptidyl-prolyl cis-trans isomerase NIMA-interacting 1
Name:Peptidyl-prolyl cis-trans isomerase NIMA-interacting 1
Type:PROTEIN
Mol. Mass.:18248.11
Organism:Homo sapiens (Human)
Description:ChEMBL_1502595
Residue:163
BDBM34011
BDBM34002
NameBDBM34011
Synonyms:3-fluorophenylalanine derivative, 21a
TypeSmall organic molecule
Emp. Form.C20H19FNO5P
Mol. Mass.403.3407
SMILESOP(O)(=O)OC[C@@H](Cc1cccc(F)c1)NC(=O)c1ccc2ccccc2c1