Reaction Details
TargetCarbonic anhydrase
LigandBDBM10870
Substrate/CompetitorBDBM10856
Meas. Tech.CA Inhibition Assay
Ki 42±n/a nM
Citation Innocenti, AHall, RASchlicker, CScozzafava, ASteegborn, CMühlschlegel, FASupuran, CT Carbonic anhydrase inhibitors. Inhibition and homology modeling studies of the fungal beta-carbonic anhydrase from Candida albicans with sulfonamides. Bioorg Med Chem17:4503-9 (2009) 
 
Carbonic anhydrase
Name:Carbonic anhydrase
Synonyms:Carbonic Anhydrase 2 (Can2)
Type:Enzyme
Mol. Mass.:26594.37
Organism:Cryptococcus neoformans var. grubii (Filobasidiella neoformans var. grubii)
Description:n/a
Residue:239
BDBM10870
BDBM10856
NameBDBM10870
TypeSmall organic molecule
Emp. Form.C8H9N5O4S3
Mol. Mass.335.383
SMILESNc1ccc(cc1)S(=O)(=O)Nc1nnc(s1)S(N)(=O)=O