Reaction Details
TargetCarbonic anhydrase
LigandBDBM10881
Substrate/CompetitorBDBM10856
Meas. Tech.CA Inhibition Assay
Ki 63±n/a nM
Citation Innocenti, AHall, RASchlicker, CScozzafava, ASteegborn, CMühlschlegel, FASupuran, CT Carbonic anhydrase inhibitors. Inhibition and homology modeling studies of the fungal beta-carbonic anhydrase from Candida albicans with sulfonamides. Bioorg Med Chem17:4503-9 (2009) 
 
Carbonic anhydrase
Name:Carbonic anhydrase
Synonyms:Carbonic Anhydrase 2 (Can2)
Type:Enzyme
Mol. Mass.:26594.37
Organism:Cryptococcus neoformans var. grubii (Filobasidiella neoformans var. grubii)
Description:n/a
Residue:239
BDBM10881
BDBM10856
NameBDBM10881
TypeSmall organic molecule
Emp. Form.C5H8N4O3S2
Mol. Mass.236.272
SMILESCC(=O)N=c1sc(nn1C)S(N)(=O)=O