Reaction Details
TargetCarbonic anhydrase
LigandBDBM10887
Substrate/CompetitorBDBM10856
Meas. Tech.CA Inhibition Assay
Ki 367±n/a nM
Citation Innocenti, AHall, RASchlicker, CScozzafava, ASteegborn, CMühlschlegel, FASupuran, CT Carbonic anhydrase inhibitors. Inhibition and homology modeling studies of the fungal beta-carbonic anhydrase from Candida albicans with sulfonamides. Bioorg Med Chem17:4503-9 (2009) 
 
Carbonic anhydrase
Name:Carbonic anhydrase
Synonyms:Carbonic Anhydrase 2 (Can2)
Type:Enzyme
Mol. Mass.:26594.37
Organism:Cryptococcus neoformans var. grubii (Filobasidiella neoformans var. grubii)
Description:n/a
Residue:239
BDBM10887
BDBM10856
NameBDBM10887
TypeSmall organic molecule
Emp. Form.C12H21NO8S
Mol. Mass.339.362
SMILESCC1(C)O[C@@H]2CO[C@@]3(COS(N)(=O)=O)OC(C)(C)O[C@H]3[C@@H]2O1