Reaction Details
TargetSarcoplasmic/endoplasmic reticulum calcium ATPase 1
LigandBDBM34112
Substrate/CompetitorBDBM2
Meas. Tech.Determination of Inhibitory Potencies by Coupled ATPase Activity Assay
pH7.3±n/a
Temperature310.15±n/a K
IC50 5700±2900 nM
Citation Paula, SAbell, JDeye, JElam, CLape, MPurnell, JRatliff, RSebastian, KZultowsky, JKempton, RJ Design, synthesis, and biological evaluation of hydroquinone derivatives as novel inhibitors of the sarco/endoplasmic reticulum calcium ATPase. Bioorg Med Chem17:6613-9 (2009) 
 
Sarcoplasmic/endoplasmic reticulum calcium ATPase 1
Name:Sarcoplasmic/endoplasmic reticulum calcium ATPase 1
Type:PROTEIN
Mol. Mass.:110435.34
Organism:Oryctolagus cuniculus
Description:ChEMBL_1500621
Residue:1001
BDBM34112
BDBM2
NameBDBM34112
Synonyms:hydroquinone derivative, 2b
TypeSmall organic molecule
Emp. Form.C13H11NO4
Mol. Mass.245.2307
SMILESOc1ccc(O)c(Cc2ccc(cc2)[N+]([O-])=O)c1