Reaction Details
Target5-hydroxytryptamine receptor 6
LigandBDBM34147
Substrate/CompetitorBDBM21342
Meas. Tech.5-HT6 Binding Assay
pH7.4±n/a
Temperature310.15±n/a K
Ki 1±n/a nM
EC50 53.3±n/a nM
Commentsantagonist.
Citation Alcalde, EMesquida, NLópez-Pérez, SFrigola, JMercè, RHolenz, JPujol, MHernández, E Indene-based frameworks targeting the 5-HT6 serotonin receptor: ring constraint in indenylsulfonamides using cyclic amines and structurally abbreviated counterparts. Bioorg Med Chem17:7387-97 (2009) 
 
5-hydroxytryptamine receptor 6
Name:5-hydroxytryptamine receptor 6
Type:G Protein-Coupled Receptor (GPCR)
Mol. Mass.:46968.43
Organism:Homo sapiens (Human)
Description:P50406
Residue:440
BDBM34147
BDBM21342
NameBDBM34147
Synonyms:CHEMBL425196 | pyrrolidinylindole, 6
TypeSmall organic molecule
Emp. Form.C19H19BrN2O2S
Mol. Mass.419.335
SMILESCN1CCC(C1)c1cn(c2ccccc12)S(=O)(=O)c1ccccc1Br