Reaction Details
Target5-hydroxytryptamine receptor 6
LigandBDBM34148
Substrate/CompetitorBDBM21342
Meas. Tech.5-HT6 Binding Assay
pH7.4±n/a
Temperature310.15±n/a K
Ki 2±n/a nM
EC50 24±n/a nM
Commentsagonist.
Citation Alcalde, EMesquida, NLópez-Pérez, SFrigola, JMercè, RHolenz, JPujol, MHernández, E Indene-based frameworks targeting the 5-HT6 serotonin receptor: ring constraint in indenylsulfonamides using cyclic amines and structurally abbreviated counterparts. Bioorg Med Chem17:7387-97 (2009) 
 
5-hydroxytryptamine receptor 6
Name:5-hydroxytryptamine receptor 6
Type:G Protein-Coupled Receptor (GPCR)
Mol. Mass.:46968.43
Organism:Homo sapiens (Human)
Description:P50406
Residue:440
BDBM34148
BDBM21342
NameBDBM34148
Synonyms:CHEMBL371292 | piperidinylindole, 7
TypeSmall organic molecule
Emp. Form.C19H20N2O2S
Mol. Mass.340.439
SMILESO=S(=O)(c1ccccc1)n1cc(C2CCCNC2)c2ccccc12