Reaction Details
TargetTyrosine-protein kinase Mer
LigandBDBM350848
Substrate/Competitorn/a
Meas. Tech.Inhibition Assay
IC50 0.540±n/a nM
Citation Wang, XZhang, WFrye, S Therapeutic uses of selected pyrrolopyrimidine compounds with anti-mer tyrosine kinase activity US Patent US10004755 Publication Date 6/26/2018
 
Tyrosine-protein kinase Mer
Name:Tyrosine-protein kinase Mer
Type:PROTEIN
Mol. Mass.:110234.77
Organism:Homo sapiens (Human)
Description:ChEMBL_1498723
Residue:999
BDBM350848
NameBDBM350848
Synonyms:UNC2078A US9795606, B7
TypeSmall organic molecule
Emp. Form.C27H37N5O3S
Mol. Mass.511.679
SMILESCCCCNc1ncc2c(cn(C3CC[C@H](O)CC3)c2n1)-c1ccc(cc1)S(=O)(=O)N1CCCCC1