Reaction Details
TargetTyrosine-protein kinase Mer
LigandBDBM350861
Substrate/Competitorn/a
Meas. Tech.Inhibition Assay
IC50 0.970±n/a nM
Citation Wang, XZhang, WFrye, S Therapeutic uses of selected pyrrolopyrimidine compounds with anti-mer tyrosine kinase activity US Patent US10004755 Publication Date 6/26/2018
 
Tyrosine-protein kinase Mer
Name:Tyrosine-protein kinase Mer
Type:PROTEIN
Mol. Mass.:110234.77
Organism:Homo sapiens (Human)
Description:ChEMBL_1498723
Residue:999
BDBM350861
NameBDBM350861
Synonyms:UNC2371A US9795606, B20
TypeSmall organic molecule
Emp. Form.C29H40N6O
Mol. Mass.488.6675
SMILESCN1CCN(Cc2ccc(cc2)-c2cn(C3CC[C@H](O)CC3)c3nc(NCCC4CC4)ncc23)CC1