Reaction Details
TargetOxysterols receptor LXR-beta [154-461]
LigandBDBM20000
Substrate/CompetitorBDBM19993
Meas. Tech.LXRbeta Binding Assay (IC50) and LAFbeta Functional Assay (EC50)
pH7.4±n/a
Temperature277.15±n/a K
IC50 2.1±n/a nM
EC50 71±n/a nM
CommentsEfficacy=97%.
Citation Bernotas, RCKaufman, DHSinghaus, RRUllrich, JUnwalla, RQuinet, ENambi, PWilhelmsson, AGoos-Nilsson, AWrobel, J 4-(3-aryloxyaryl)quinoline alcohols are liver X receptor agonists. Bioorg Med Chem17:8086-92 (2009) 
 
Oxysterols receptor LXR-beta [154-461]
Name:Oxysterols receptor LXR-beta [154-461]
Type:Receptor
Mol. Mass.:34695.52
Organism:Homo sapiens (Human)
Description:LXR beta ligand binding domain (amino acid residues 154-461) with an N-terminal biotinylation tag expressed in E.coli, was used for the binding assays.
Residue:308
BDBM20000
BDBM19993
NameBDBM20000
Synonyms:2-(4-{3-[3-benzyl-8-(trifluoromethyl)quinolin-4-yl]phenoxymethyl}phenyl)acetic acid JMC496151 Compound 15 | WAY-254011
TypeSmall organic molecule
Emp. Form.C32H24F3NO3
Mol. Mass.527.5331
SMILESOC(=O)Cc1ccc(COc2cccc(c2)-c2c(Cc3ccccc3)cnc3c(cccc23)C(F)(F)F)cc1