Reaction Details
TargetOxysterols receptor LXR-beta [154-461]
LigandBDBM35089
Substrate/CompetitorBDBM19993
Meas. Tech.LXRbeta Binding Assay (IC50) and LAFbeta Functional Assay (EC50)
pH7.4±n/a
Temperature277.15±n/a K
IC50 3.3±n/a nM
EC50 31±n/a nM
CommentsEfficacy=106%.
Citation Bernotas, RCKaufman, DHSinghaus, RRUllrich, JUnwalla, RQuinet, ENambi, PWilhelmsson, AGoos-Nilsson, AWrobel, J 4-(3-aryloxyaryl)quinoline alcohols are liver X receptor agonists. Bioorg Med Chem17:8086-92 (2009) 
 
Oxysterols receptor LXR-beta [154-461]
Name:Oxysterols receptor LXR-beta [154-461]
Type:Receptor
Mol. Mass.:34695.52
Organism:Homo sapiens (Human)
Description:LXR beta ligand binding domain (amino acid residues 154-461) with an N-terminal biotinylation tag expressed in E.coli, was used for the binding assays.
Residue:308
BDBM35089
BDBM19993
NameBDBM35089
Synonyms:biarylether alcohol quinoline, 5b
TypeSmall organic molecule
Emp. Form.C32H26F3NO2
Mol. Mass.513.5495
SMILESCC(C)(O)c1cccc(Oc2cccc(c2)-c2c(Cc3ccccc3)cnc3c(cccc23)C(F)(F)F)c1