Reaction Details
TargetOxysterols receptor LXR-beta [154-461]
LigandBDBM35092
Substrate/CompetitorBDBM19993
Meas. Tech.LXRbeta Binding Assay (IC50) and LAFbeta Functional Assay (EC50)
pH7.4±n/a
Temperature277.15±n/a K
IC50 8.3±n/a nM
EC50 1010±n/a nM
CommentsEfficacy=104%.
Citation Bernotas, RCKaufman, DHSinghaus, RRUllrich, JUnwalla, RQuinet, ENambi, PWilhelmsson, AGoos-Nilsson, AWrobel, J 4-(3-aryloxyaryl)quinoline alcohols are liver X receptor agonists. Bioorg Med Chem17:8086-92 (2009) 
 
Oxysterols receptor LXR-beta [154-461]
Name:Oxysterols receptor LXR-beta [154-461]
Type:Receptor
Mol. Mass.:34695.52
Organism:Homo sapiens (Human)
Description:LXR beta ligand binding domain (amino acid residues 154-461) with an N-terminal biotinylation tag expressed in E.coli, was used for the binding assays.
Residue:308
BDBM35092
BDBM19993
NameBDBM35092
Synonyms:biarylether alcohol quinoline, 5e
TypeSmall organic molecule
Emp. Form.C28H20ClNO2
Mol. Mass.437.917
SMILESOCc1ccc(Oc2cccc(c2)-c2c(cnc3c(Cl)cccc23)-c2ccccc2)cc1