Reaction Details
TargetOxysterols receptor LXR-beta [154-461]
LigandBDBM35105
Substrate/CompetitorBDBM19993
Meas. Tech.LXR Binding Assay and hLXR Reporter Assay
pH7.4±n/a
Temperature277.15±n/a K
IC50 2.6±n/a nM
EC50 98±n/a nM
CommentsEfficacy=89%.
Citation Bernotas, RCSinghaus, RRKaufman, DHUllrich, JFletcher, HQuinet, ENambi, PUnwalla, RWilhelmsson, AGoos-Nilsson, AFarnegardh, MWrobel, J Biarylether amide quinolines as liver X receptor agonists. Bioorg Med Chem17:1663-70 (2009) 
 
Oxysterols receptor LXR-beta [154-461]
Name:Oxysterols receptor LXR-beta [154-461]
Type:Receptor
Mol. Mass.:34695.52
Organism:Homo sapiens (Human)
Description:LXR beta ligand binding domain (amino acid residues 154-461) with an N-terminal biotinylation tag expressed in E.coli, was used for the binding assays.
Residue:308
BDBM35105
BDBM19993
NameBDBM35105
Synonyms:biarylether amide quinoline, 4e
TypeSmall organic molecule
Emp. Form.C34H27F3N2O2
Mol. Mass.552.5856
SMILESFC(F)(F)c1cccc2c(c(Cc3ccccc3)cnc12)-c1cccc(Oc2cccc(c2)C(=O)N2CCCC2)c1