Reaction Details
TargetOxysterols receptor LXR-beta [154-461]
LigandBDBM35113
Substrate/CompetitorBDBM19993
Meas. Tech.LXR Binding Assay and hLXR Reporter Assay
pH7.4±n/a
Temperature277.15±n/a K
IC50 3±n/a nM
Citation Bernotas, RCSinghaus, RRKaufman, DHUllrich, JFletcher, HQuinet, ENambi, PUnwalla, RWilhelmsson, AGoos-Nilsson, AFarnegardh, MWrobel, J Biarylether amide quinolines as liver X receptor agonists. Bioorg Med Chem17:1663-70 (2009) 
 
Oxysterols receptor LXR-beta [154-461]
Name:Oxysterols receptor LXR-beta [154-461]
Type:Receptor
Mol. Mass.:34695.52
Organism:Homo sapiens (Human)
Description:LXR beta ligand binding domain (amino acid residues 154-461) with an N-terminal biotinylation tag expressed in E.coli, was used for the binding assays.
Residue:308
BDBM35113
BDBM19993
NameBDBM35113
Synonyms:biarylether amide quinoline, 4n
TypeSmall organic molecule
Emp. Form.C27H23ClN2O2
Mol. Mass.442.937
SMILESCc1cnc2c(Cl)cccc2c1-c1cccc(Oc2cccc(c2)C(=O)N2CCCC2)c1