Reaction Details
TargetSodium-dependent noradrenaline transporter
LigandBDBM35226
Substrate/CompetitorBDBM22417
Meas. Tech.Radioligand Binding Assay (Ki)
pH7.4±n/a
Temperature310.15±n/a K
Ki 0.3±n/a nM
Citation Heffernan, GDCoghlan, RDManas, ESMcDevitt, RELi, YMahaney, PERobichaud, AJHuselton, CAlfinito, PBray, JACosmi, SAJohnston, GHKenney, TKoury, EWinneker, RCDeecher, DCTrybulski, EJ Dual acting norepinephrine reuptake inhibitors and 5-HT(2A) receptor antagonists: Identification, synthesis and activity of novel 4-aminoethyl-3-(phenylsulfonyl)-1H-indoles. Bioorg Med Chem17:7802-15 (2009) 
 
Sodium-dependent noradrenaline transporter
Name:Sodium-dependent noradrenaline transporter
Type:Multi-pass membrane protein
Mol. Mass.:69337.72
Organism:Homo sapiens (Human)
Description:P23975
Residue:617
BDBM35226
BDBM22417
NameBDBM35226
Synonyms:(S,S)-reboxetine Vestra
TypeSmall organic molecule
Emp. Form.C19H23NO3
Mol. Mass.313.3908
SMILESCCOc1ccccc1O[C@H]([C@@H]1CNCCO1)c1ccccc1