Reaction Details
Target5-hydroxytryptamine receptor 2A
LigandBDBM35250
Substrate/CompetitorBDBM21395
Meas. Tech.Radioligand Binding Assay (Ki) and Norepinephrine Uptake Assay (IC50)
Ki 46±n/a nM
IC50 57±n/a nM
Citation Heffernan, GDCoghlan, RDManas, ESMcDevitt, RELi, YMahaney, PERobichaud, AJHuselton, CAlfinito, PBray, JACosmi, SAJohnston, GHKenney, TKoury, EWinneker, RCDeecher, DCTrybulski, EJ Dual acting norepinephrine reuptake inhibitors and 5-HT(2A) receptor antagonists: Identification, synthesis and activity of novel 4-aminoethyl-3-(phenylsulfonyl)-1H-indoles. Bioorg Med Chem17:7802-15 (2009) 
 
5-hydroxytryptamine receptor 2A
Name:5-hydroxytryptamine receptor 2A
Type:undefined
Mol. Mass.:52607.65
Organism:Homo sapiens (Human)
Description:P28223
Residue:471
BDBM35250
BDBM21395
NameBDBM35250
Synonyms:3-(phenylsulfonyl)-1H-indole, 18l
TypeSmall organic molecule
Emp. Form.C22H26N2O2S
Mol. Mass.382.519
SMILESCC1CCCN(CCc2cccc3[nH]cc(c23)S(=O)(=O)c2ccccc2)C1