Reaction Details
TargetNAD(P)H dehydrogenase [quinone] 1
LigandBDBM35538
Substrate/CompetitorBDBM24778
Meas. Tech.Inhibition of NQO1 (With 2 uM BSA)
pH7.5±n/a
Temperature298.15±n/a K
IC50 22333±12660 nM
Citation Nolan, KADoncaster, JRDunstan, MSScott, KAFrenkel, ADSiegel, DRoss, DBarnes, JLevy, CLeys, DWhitehead, RCStratford, IJBryce, RA Synthesis and biological evaluation of coumarin-based inhibitors of NAD(P)H: quinone oxidoreductase-1 (NQO1). J Med Chem52:7142-56 (2009) 
 
NAD(P)H dehydrogenase [quinone] 1
Name:NAD(P)H dehydrogenase [quinone] 1
Type:Homodimer
Mol. Mass.:30874.82
Organism:Homo sapiens (Human)
Description:n/a
Residue:274
BDBM35538
BDBM24778
NameBDBM35538
Synonyms:CHEMBL81697 | symmetric dicoumarol analogue, 14
TypeSmall organic molecule
Emp. Form.C22H16O8
Mol. Mass.408.3576
SMILESCCOC(=O)C(c1c(O)c2ccccc2oc1=O)c1c(O)c2ccccc2oc1=O