Reaction Details
TargetNAD(P)H dehydrogenase [quinone] 1
LigandBDBM35547
Substrate/CompetitorBDBM24778
Meas. Tech.Inhibition of NQO1 (With 2 uM BSA)
pH7.5±n/a
Temperature298.15±n/a K
IC50 2366±1401 nM
Citation Nolan, KADoncaster, JRDunstan, MSScott, KAFrenkel, ADSiegel, DRoss, DBarnes, JLevy, CLeys, DWhitehead, RCStratford, IJBryce, RA Synthesis and biological evaluation of coumarin-based inhibitors of NAD(P)H: quinone oxidoreductase-1 (NQO1). J Med Chem52:7142-56 (2009) 
 
NAD(P)H dehydrogenase [quinone] 1
Name:NAD(P)H dehydrogenase [quinone] 1
Type:Homodimer
Mol. Mass.:30874.82
Organism:Homo sapiens (Human)
Description:n/a
Residue:274
BDBM35547
BDBM24778
NameBDBM35547
Synonyms:4-hydroxy-2H-chromen-2-one core, 23
TypeSmall organic molecule
Emp. Form.C24H16O3
Mol. Mass.352.382
SMILESOc1c(Cc2ccc3ccccc3c2)c(=O)oc2ccc3ccccc3c12