Reaction Details
TargetNAD(P)H dehydrogenase [quinone] 1
LigandBDBM35529
Substrate/CompetitorBDBM24778
Meas. Tech.Inhibition of NQO1 (With 2 uM BSA)
pH7.5±n/a
IC50 6.0±n/a nM
Commentsextracted
Citation Nolan, KADoncaster, JRDunstan, MSScott, KAFrenkel, ADSiegel, DRoss, DBarnes, JLevy, CLeys, DWhitehead, RCStratford, IJBryce, RA Synthesis and biological evaluation of coumarin-based inhibitors of NAD(P)H: quinone oxidoreductase-1 (NQO1). J Med Chem52:7142-56 (2009) 
 
NAD(P)H dehydrogenase [quinone] 1
Name:NAD(P)H dehydrogenase [quinone] 1
Type:Homodimer
Mol. Mass.:30874.82
Organism:Homo sapiens (Human)
Description:n/a
Residue:274
BDBM35529
BDBM24778
NameBDBM35529
Synonyms:symmetric dicoumarol analogue, 5
TypeSmall organic molecule
Emp. Form.C21H16O8
Mol. Mass.396.3469
SMILESCOc1ccc2c(O)c(Cc3c(O)c4ccc(OC)cc4oc3=O)c(=O)oc2c1