Reaction Details
TargetNAD(P)H dehydrogenase [quinone] 1
LigandBDBM35536
Substrate/CompetitorBDBM24778
Meas. Tech.Inhibition of NQO1 (With 2 uM BSA)
pH7.5±n/a
IC50 0.18±n/a nM
Commentsextracted
Citation Nolan, KADoncaster, JRDunstan, MSScott, KAFrenkel, ADSiegel, DRoss, DBarnes, JLevy, CLeys, DWhitehead, RCStratford, IJBryce, RA Synthesis and biological evaluation of coumarin-based inhibitors of NAD(P)H: quinone oxidoreductase-1 (NQO1). J Med Chem52:7142-56 (2009) 
 
NAD(P)H dehydrogenase [quinone] 1
Name:NAD(P)H dehydrogenase [quinone] 1
Type:Homodimer
Mol. Mass.:30874.82
Organism:Homo sapiens (Human)
Description:n/a
Residue:274
BDBM35536
BDBM24778
NameBDBM35536
Synonyms:symmetric dicoumarol analogue, 12
TypeSmall organic molecule
Emp. Form.C27H16O6
Mol. Mass.436.4123
SMILESOc1c(Cc2c(O)c3ccc4ccccc4c3oc2=O)c(=O)oc2c1ccc1ccccc21