Reaction Details
TargetNAD(P)H dehydrogenase [quinone] 1
LigandBDBM35552
Substrate/CompetitorBDBM24778
Meas. Tech.Inhibition of NQO1 (With 2 uM BSA)
pH7.5±n/a
IC50 9.9±n/a nM
Commentsextracted
Citation Nolan, KADoncaster, JRDunstan, MSScott, KAFrenkel, ADSiegel, DRoss, DBarnes, JLevy, CLeys, DWhitehead, RCStratford, IJBryce, RA Synthesis and biological evaluation of coumarin-based inhibitors of NAD(P)H: quinone oxidoreductase-1 (NQO1). J Med Chem52:7142-56 (2009) 
 
NAD(P)H dehydrogenase [quinone] 1
Name:NAD(P)H dehydrogenase [quinone] 1
Type:Homodimer
Mol. Mass.:30874.82
Organism:Homo sapiens (Human)
Description:n/a
Residue:274
BDBM35552
BDBM24778
NameBDBM35552
Synonyms:4-hydroxy-2H-chromen-2-one core, 29
TypeSmall organic molecule
Emp. Form.C20H20O3
Mol. Mass.308.371
SMILESCc1ccc(Cc2c(O)c3cc(C)c(C)cc3oc2=O)cc1C