Reaction Details
TargetVasopressin V2 receptor
LigandBDBM35725
Substrate/CompetitorBDBM35667
Meas. Tech.Radioligand Binding Assay to HeLa Cells
pH7.4±n/a
Temperature277.15±n/a K
IC50 5±n/a nM
Citation Kondo, KOgawa, HYamashita, HMiyamoto, HTanaka, MNakaya, KKitano, KYamamura, YNakamura, SOnogawa, TMori, TTominaga, M 7-Chloro-5-hydroxy-1-[2-methyl-4-(2-methylbenzoyl-amino)benzoyl ]-2,3,4,5-tetrahydro-1H-1-benzazepine (OPC-41061): a potent, orally active nonpeptide arginine vasopressin V2 receptor antagonist. Bioorg Med Chem7:1743-54 (1999) 
 
Vasopressin V2 receptor
Name:Vasopressin V2 receptor
Type:Receptor
Mol. Mass.:40295.28
Organism:Homo sapiens (Human)
Description:P30518
Residue:371
BDBM35725
BDBM35667
NameBDBM35725
Synonyms:benzazepine derivative, 34
TypeSmall organic molecule
Emp. Form.C26H25ClN2O4
Mol. Mass.464.941
SMILESCOc1cc(ccc1NC(=O)c1ccccc1C)C(=O)N1CCCC(O)c2cc(Cl)ccc12