Reaction Details
TargetCarbonic anhydrase 1
LigandBDBM35727
Substrate/CompetitorBDBM10856
Meas. Tech.CA Inhibition Assay
pH7.4±n/a
Temperature298.15±n/a K
Ki 161±n/a nM
Citation Güzel, OInnocenti, AScozzafava, ASalman, ASupuran, CT Carbonic anhydrase inhibitors. Aromatic/heterocyclic sulfonamides incorporating phenacetyl, pyridylacetyl and thienylacetyl tails act as potent inhibitors of human mitochondrial isoforms VA and VB. Bioorg Med Chem17:4894-9 (2009) 
 
Carbonic anhydrase 1
Name:Carbonic anhydrase 1
Type:Enzyme
Mol. Mass.:28873.37
Organism:Homo sapiens (Human)
Description:P00915
Residue:261
BDBM35727
BDBM10856
NameBDBM35727
Synonyms:sulfonamide deriv., 5b
TypeSmall organic molecule
Emp. Form.C12H11FN2O3S2
Mol. Mass.314.356
SMILESNS(=O)(=O)c1ccc(NC(=O)Cc2cccs2)c(F)c1