Reaction Details
TargetCarbonic anhydrase 5B, mitochondrial
LigandBDBM35731
Substrate/CompetitorBDBM10856
Meas. Tech.CA Inhibition Assay
Temperature298.15±n/a K
Ki 8.0±n/a nM
Commentsextracted
Citation Güzel, OInnocenti, AScozzafava, ASalman, ASupuran, CT Carbonic anhydrase inhibitors. Aromatic/heterocyclic sulfonamides incorporating phenacetyl, pyridylacetyl and thienylacetyl tails act as potent inhibitors of human mitochondrial isoforms VA and VB. Bioorg Med Chem17:4894-9 (2009) 
 
Carbonic anhydrase 5B, mitochondrial
Name:Carbonic anhydrase 5B, mitochondrial
Type:Enzyme
Mol. Mass.:36440.83
Organism:Homo sapiens (Human)
Description:Human (cloned) isozyme
Residue:317
BDBM35731
BDBM10856
NameBDBM35731
Synonyms:sulfonamide deriv., 5f
TypeSmall organic molecule
Emp. Form.C14H16N2O3S2
Mol. Mass.324.418
SMILESNS(=O)(=O)c1ccc(CCNC(=O)Cc2cccs2)cc1