Reaction Details
TargetCarbonic anhydrase 5B, mitochondrial
LigandBDBM35736
Substrate/CompetitorBDBM10856
Meas. Tech.CA Inhibition Assay
Temperature298.15±n/a K
Ki 8.1±n/a nM
Commentsextracted
Citation Güzel, OInnocenti, AScozzafava, ASalman, ASupuran, CT Carbonic anhydrase inhibitors. Aromatic/heterocyclic sulfonamides incorporating phenacetyl, pyridylacetyl and thienylacetyl tails act as potent inhibitors of human mitochondrial isoforms VA and VB. Bioorg Med Chem17:4894-9 (2009) 
 
Carbonic anhydrase 5B, mitochondrial
Name:Carbonic anhydrase 5B, mitochondrial
Type:Enzyme
Mol. Mass.:36440.83
Organism:Homo sapiens (Human)
Description:Human (cloned) isozyme
Residue:317
BDBM35736
BDBM10856
NameBDBM35736
Synonyms:sulfonamide deriv., 7d
TypeSmall organic molecule
Emp. Form.C14H13FN2O3S
Mol. Mass.308.328
SMILESNS(=O)(=O)c1ccc(NC(=O)Cc2ccccc2)c(F)c1