Reaction Details
TargetAlpha-carbonic anhydrase domain-containing protein
LigandBDBM25907
Substrate/CompetitorBDBM10856
Meas. Tech.CA Inhibition Assay
pH7.4±n/a
Temperature298.15±n/a K
Ki 12.2±n/a nM
Citation Güzel, OInnocenti, AHall, RAScozzafava, AMühlschlegel, FASupuran, CT Carbonic anhydrase inhibitors. The nematode alpha-carbonic anhydrase of Caenorhabditis elegans CAH-4b is highly inhibited by 2-(hydrazinocarbonyl)-3-substituted-phenyl-1H-indole-5-sulfonamides. Bioorg Med Chem17:3212-5 (2009) 
 
Alpha-carbonic anhydrase domain-containing protein
Name:Alpha-carbonic anhydrase domain-containing protein
Type:Enzyme
Mol. Mass.:26169.24
Organism:Caenorhabditis elegans
Description:Q8WQD8
Residue:235
BDBM25907
BDBM10856
NameBDBM25907
Synonyms:2-(hydrazinecarbonyl)-3-(4-methylphenyl)-1H-indole-5-sulfonamide indole sulfonamide, 8c
TypeSmall organic molecule
Emp. Form.C16H16N4O3S
Mol. Mass.344.388
SMILESCc1ccc(cc1)-c1c([nH]c2ccc(cc12)S(N)(=O)=O)C(=O)NN