Reaction Details
TargetAlpha-carbonic anhydrase domain-containing protein
LigandBDBM25909
Substrate/CompetitorBDBM10856
Meas. Tech.CA Inhibition Assay
pH7.4±n/a
Temperature298.15±n/a K
Ki 9.9±n/a nM
Citation Güzel, OInnocenti, AHall, RAScozzafava, AMühlschlegel, FASupuran, CT Carbonic anhydrase inhibitors. The nematode alpha-carbonic anhydrase of Caenorhabditis elegans CAH-4b is highly inhibited by 2-(hydrazinocarbonyl)-3-substituted-phenyl-1H-indole-5-sulfonamides. Bioorg Med Chem17:3212-5 (2009) 
 
Alpha-carbonic anhydrase domain-containing protein
Name:Alpha-carbonic anhydrase domain-containing protein
Type:Enzyme
Mol. Mass.:26169.24
Organism:Caenorhabditis elegans
Description:Q8WQD8
Residue:235
BDBM25909
BDBM10856
NameBDBM25909
Synonyms:3-(3-fluorophenyl)-2-(hydrazinecarbonyl)-1H-indole-5-sulfonamide indole sulfonamide, 8e
TypeSmall organic molecule
Emp. Form.C15H13FN4O3S
Mol. Mass.348.352
SMILESNNC(=O)c1[nH]c2ccc(cc2c1-c1cccc(F)c1)S(N)(=O)=O