Reaction Details
TargetAlpha-carbonic anhydrase domain-containing protein
LigandBDBM25918
Substrate/CompetitorBDBM10856
Meas. Tech.CA Inhibition Assay
pH7.4±n/a
Temperature298.15±n/a K
Ki 260±n/a nM
Citation Güzel, OInnocenti, AHall, RAScozzafava, AMühlschlegel, FASupuran, CT Carbonic anhydrase inhibitors. The nematode alpha-carbonic anhydrase of Caenorhabditis elegans CAH-4b is highly inhibited by 2-(hydrazinocarbonyl)-3-substituted-phenyl-1H-indole-5-sulfonamides. Bioorg Med Chem17:3212-5 (2009) 
 
Alpha-carbonic anhydrase domain-containing protein
Name:Alpha-carbonic anhydrase domain-containing protein
Type:Enzyme
Mol. Mass.:26169.24
Organism:Caenorhabditis elegans
Description:Q8WQD8
Residue:235
BDBM25918
BDBM10856
NameBDBM25918
Synonyms:2-(hydrazinecarbonyl)-3-(2,3,4,5,6-pentafluorophenyl)-1H-indole-5-sulfonamide indole sulfonamide, 8n
TypeSmall organic molecule
Emp. Form.C15H9F5N4O3S
Mol. Mass.420.314
SMILESNNC(=O)c1[nH]c2ccc(cc2c1-c1c(F)c(F)c(F)c(F)c1F)S(N)(=O)=O