Reaction Details
TargetAdenosine receptor A2a
LigandBDBM35774
Substrate/CompetitorBDBM35804
Meas. Tech.Radioligand Binding Assay
Ki 4.9±n/a nM
Citation Gillespie, RJBamford, SJClay, AGaur, SHaymes, TJackson, PSJordan, AMKlenke, BLeonardi, SLiu, JMansell, HLNg, SSaadi, MSimmonite, HStratton, GCTodd, RSWilliamson, DSYule, IA Antagonists of the human A(2A) receptor. Part 6: Further optimization of pyrimidine-4-carboxamides. Bioorg Med Chem17:6590-605 (2009) 
 
Adenosine receptor A2a
Name:Adenosine receptor A2a
Type:G Protein-Coupled Receptor (GPCR)
Mol. Mass.:44716.46
Organism:Homo sapiens (Human)
Description:P29274
Residue:412
BDBM35774
BDBM35804
NameBDBM35774
Synonyms:triazine-4-carboxamide, 6
TypeSmall organic molecule
Emp. Form.C15H12ClN5O2
Mol. Mass.329.741
SMILESNc1nc(nc(n1)-c1ccco1)C(=O)NCc1ccccc1Cl