Reaction Details
TargetAdenosine receptor A2a
LigandBDBM35784
Substrate/CompetitorBDBM35804
Meas. Tech.Radioligand Binding Assay
Ki 2.8±n/a nM
Citation Gillespie, RJBamford, SJClay, AGaur, SHaymes, TJackson, PSJordan, AMKlenke, BLeonardi, SLiu, JMansell, HLNg, SSaadi, MSimmonite, HStratton, GCTodd, RSWilliamson, DSYule, IA Antagonists of the human A(2A) receptor. Part 6: Further optimization of pyrimidine-4-carboxamides. Bioorg Med Chem17:6590-605 (2009) 
 
Adenosine receptor A2a
Name:Adenosine receptor A2a
Type:G Protein-Coupled Receptor (GPCR)
Mol. Mass.:44716.46
Organism:Homo sapiens (Human)
Description:P29274
Residue:412
BDBM35784
BDBM35804
NameBDBM35784
Synonyms:pyrimidine-4-carboxamide, 19 | pyrimidine-4-carboxamide, 26
TypeSmall organic molecule
Emp. Form.C16H15N5O2
Mol. Mass.309.3226
SMILESCc1cccnc1CNC(=O)c1cc(nc(N)n1)-c1ccco1