Reaction Details
TargetCannabinoid receptor 1
LigandBDBM35873
Substrate/CompetitorBDBM35866
Meas. Tech.GTP-gamma-S Binding Assay
pH7.4±n/a
Temperature303.15±n/a K
IC50 4±n/a nM
Citation Boström, JBerggren, KElebring, TGreasley, PJWilstermann, M Scaffold hopping, synthesis and structure-activity relationships of 5,6-diaryl-pyrazine-2-amide derivatives: a novel series of CB1 receptor antagonists. Bioorg Med Chem15:4077-84 (2007) 
 
Cannabinoid receptor 1
Name:Cannabinoid receptor 1
Type:G Protein-Coupled Receptor (GPCR)
Mol. Mass.:52868.96
Organism:Homo sapiens (Human)
Description:P21554
Residue:472
BDBM35873
BDBM35866
NameBDBM35873
Synonyms:5,6-bis(4-chlorophenyl)-N-(piperidin-1-yl)pyrazine-2-carboxamide 5,6-diaryl-pyrazine-2-amide derivative, 5e | CHEMBL390146
TypeSmall organic molecule
Emp. Form.C22H20Cl2N4O
Mol. Mass.427.326
SMILESClc1ccc(cc1)-c1ncc(nc1-c1ccc(Cl)cc1)C(=O)NN1CCCCC1